Reaction Details
Target3-oxo-5-alpha-steroid 4-dehydrogenase 1
LigandBDBM50092485
Substrate/Competitorn/a
Meas. Tech.ChEMBL_205064 (CHEMBL810258)
IC50 7.6±n/a nM
Citation Guarna, AMachetti, FOcchiato, EGScarpi, DComerci, ADanza, GMancina, RSerio, MHardy, K Benzo[c]quinolizin-3-ones: a novel class of potent and selective nonsteroidal inhibitors of human steroid 5alpha-reductase 1. J Med Chem43:3718-35 (2000) 3-oxo-5-alpha-steroid 4-dehydrogenase 1
Name:3-oxo-5-alpha-steroid 4-dehydrogenase 1
Type:Enzyme
Mol. Mass.:29472.80
Organism:Homo sapiens (Human)
Description:P18405
Residue:259
BDBM50092485
NameBDBM50092485
Synonyms:4-methyl-8-chloro-1,2,5,6-tetrahydro pyrido[1,2-a]quinolin-3-one CHEMBL118446
TypeSmall organic molecule
Emp. Form.C14H14ClNO
Mol. Mass.247.72
SMILESCC1=C2CCc3cc(Cl)ccc3N2CCC1=O