Reaction Details
TargetDihydrofolate reductase
LigandBDBM18796
Substrate/Competitorn/a
Meas. Tech.ChEMBL_54906 (CHEMBL664715)
IC50 2300±n/a nM
Citation Gangjee, AYu, JMcGuire, JJCody, VGalitsky, NKisliuk, RLQueener, SF Design, synthesis, and X-ray crystal structure of a potent dual inhibitor of thymidylate synthase and dihydrofolate reductase as an antitumor agent. J Med Chem43:3837-51 (2000) Dihydrofolate reductase
Name:Dihydrofolate reductase
Type:Enzyme
Mol. Mass.:21453.99
Organism:Homo sapiens (Human)
Description:Recombinant human DHFR.
Residue:187
BDBM18796
NameBDBM18796
Synonyms:(2S)-2-{[4-(2-{2-amino-4-oxo-1H,4H,7H-pyrrolo[2,3-d]pyrimidin-5-yl}ethyl)phenyl]formamido}pentanedioic acid Pemetrexed
TypeSmall organic molecule
Emp. Form.C20H21N5O6
Mol. Mass.427.4106
SMILESNc1nc2[nH]cc(CCc3ccc(cc3)C(=O)N[C@@H](CCC(O)=O)C(O)=O)c2c(=O)[nH]1