Reaction Details
TargetD(2) dopamine receptor
LigandBDBM50369652
Substrate/Competitorn/a
Meas. Tech.ChEMBL_59915 (CHEMBL671074)
IC50 5±n/a nM
Citation Zhang, XHodgetts, KRachwal, SZhao, HWasley, JWCraven, KBrodbeck, RKieltyka, AHoffman, DBacolod, MDGirard, BTran, JThurkauf, A trans-1-[(2-Phenylcyclopropyl)methyl]-4-arylpiperazines: mixed dopamine D(2)/D(4) receptor antagonists as potential antipsychotic agents. J Med Chem43:3923-32 (2000) D(2) dopamine receptor
Name:D(2) dopamine receptor
Type:Cell-surface receptors
Mol. Mass.:50647.10
Organism:Homo sapiens (Human)
Description:P14416
Residue:443
BDBM50369652
NameBDBM50369652
Synonyms:CHEMBL1202215
TypeSmall organic molecule
Emp. Form.C20H23ClN2
Mol. Mass.326.863
SMILESClc1ccccc1N1CCN(C[C@H]2C[C@@H]2c2ccccc2)CC1