Reaction Details
TargetD(2) dopamine receptor
LigandBDBM50369653
Substrate/Competitorn/a
Meas. Tech.ChEMBL_59915 (CHEMBL671074)
IC50 208±n/a nM
Citation Zhang, XHodgetts, KRachwal, SZhao, HWasley, JWCraven, KBrodbeck, RKieltyka, AHoffman, DBacolod, MDGirard, BTran, JThurkauf, A trans-1-[(2-Phenylcyclopropyl)methyl]-4-arylpiperazines: mixed dopamine D(2)/D(4) receptor antagonists as potential antipsychotic agents. J Med Chem43:3923-32 (2000) D(2) dopamine receptor
Name:D(2) dopamine receptor
Type:Cell-surface receptors
Mol. Mass.:50647.10
Organism:Homo sapiens (Human)
Description:P14416
Residue:443
BDBM50369653
NameBDBM50369653
Synonyms:CHEMBL1202212
TypeSmall organic molecule
Emp. Form.C20H22Cl2N2
Mol. Mass.361.308
SMILESClc1ccc(cc1Cl)N1CCN(C[C@H]2C[C@@H]2c2ccccc2)CC1