Reaction Details
TargetD(2) dopamine receptor
LigandBDBM50092753
Substrate/Competitorn/a
Meas. Tech.ChEMBL_59915 (CHEMBL671074)
IC50 37±n/a nM
Citation Zhang, XHodgetts, KRachwal, SZhao, HWasley, JWCraven, KBrodbeck, RKieltyka, AHoffman, DBacolod, MDGirard, BTran, JThurkauf, A trans-1-[(2-Phenylcyclopropyl)methyl]-4-arylpiperazines: mixed dopamine D(2)/D(4) receptor antagonists as potential antipsychotic agents. J Med Chem43:3923-32 (2000) D(2) dopamine receptor
Name:D(2) dopamine receptor
Type:Cell-surface receptors
Mol. Mass.:50647.10
Organism:Homo sapiens (Human)
Description:P14416
Residue:443
BDBM50092753
NameBDBM50092753
Synonyms:(Racemate)-1-Phenyl-4-(2-phenyl-cyclopropylmethyl)-piperazine | CHEMBL341497
TypeSmall organic molecule
Emp. Form.C20H24N2
Mol. Mass.292.418
SMILESC([C@H]1C[C@@H]1c1ccccc1)N1CCN(CC1)c1ccccc1