Reaction Details
TargetD(4) dopamine receptor
LigandBDBM50369660
Substrate/Competitorn/a
Meas. Tech.ChEMBL_63087 (CHEMBL676183)
IC50 30±n/a nM
Citation Zhang, XHodgetts, KRachwal, SZhao, HWasley, JWCraven, KBrodbeck, RKieltyka, AHoffman, DBacolod, MDGirard, BTran, JThurkauf, A trans-1-[(2-Phenylcyclopropyl)methyl]-4-arylpiperazines: mixed dopamine D(2)/D(4) receptor antagonists as potential antipsychotic agents. J Med Chem43:3923-32 (2000) D(4) dopamine receptor
Name:D(4) dopamine receptor
Type:Enzyme
Mol. Mass.:48373.19
Organism:Homo sapiens (Human)
Description:P21917
Residue:419
BDBM50369660
NameBDBM50369660
Synonyms:CHEMBL1202222
TypeSmall organic molecule
Emp. Form.C20H22ClFN2
Mol. Mass.344.853
SMILESFc1ccc(cc1)[C@H]1C[C@@H]1CN1CCN(CC1)c1ccc(Cl)cc1