Reaction Details
TargetD(2) dopamine receptor
LigandBDBM50369664
Substrate/Competitorn/a
Meas. Tech.ChEMBL_59915 (CHEMBL671074)
IC50 7±n/a nM
Citation Zhang, XHodgetts, KRachwal, SZhao, HWasley, JWCraven, KBrodbeck, RKieltyka, AHoffman, DBacolod, MDGirard, BTran, JThurkauf, A trans-1-[(2-Phenylcyclopropyl)methyl]-4-arylpiperazines: mixed dopamine D(2)/D(4) receptor antagonists as potential antipsychotic agents. J Med Chem43:3923-32 (2000) D(2) dopamine receptor
Name:D(2) dopamine receptor
Type:Cell-surface receptors
Mol. Mass.:50647.10
Organism:Homo sapiens (Human)
Description:P14416
Residue:443
BDBM50369664
NameBDBM50369664
Synonyms:CHEMBL1202206
TypeSmall organic molecule
Emp. Form.C21H24Cl2N2O
Mol. Mass.391.334
SMILESCOc1ccc(cc1)[C@H]1C[C@@H]1CN1CCN(CC1)c1ccc(Cl)cc1Cl