Reaction Details
TargetD(4) dopamine receptor
LigandBDBM50369651
Substrate/Competitorn/a
Meas. Tech.ChEMBL_63087 (CHEMBL676183)
IC50 17±n/a nM
Citation Zhang, XHodgetts, KRachwal, SZhao, HWasley, JWCraven, KBrodbeck, RKieltyka, AHoffman, DBacolod, MDGirard, BTran, JThurkauf, A trans-1-[(2-Phenylcyclopropyl)methyl]-4-arylpiperazines: mixed dopamine D(2)/D(4) receptor antagonists as potential antipsychotic agents. J Med Chem43:3923-32 (2000) D(4) dopamine receptor
Name:D(4) dopamine receptor
Type:Enzyme
Mol. Mass.:48373.19
Organism:Homo sapiens (Human)
Description:P21917
Residue:419
BDBM50369651
NameBDBM50369651
Synonyms:CHEMBL1204119
TypeSmall organic molecule
Emp. Form.C22H28N2
Mol. Mass.320.4711
SMILESCc1ccc(N2CCN(C[C@H]3C[C@@H]3c3ccccc3)CC2)c(C)c1