Reaction Details
TargetD(2) dopamine receptor
LigandBDBM50369668
Substrate/Competitorn/a
Meas. Tech.ChEMBL_59915 (CHEMBL671074)
IC50 13±n/a nM
Citation Zhang, XHodgetts, KRachwal, SZhao, HWasley, JWCraven, KBrodbeck, RKieltyka, AHoffman, DBacolod, MDGirard, BTran, JThurkauf, A trans-1-[(2-Phenylcyclopropyl)methyl]-4-arylpiperazines: mixed dopamine D(2)/D(4) receptor antagonists as potential antipsychotic agents. J Med Chem43:3923-32 (2000) D(2) dopamine receptor
Name:D(2) dopamine receptor
Type:Cell-surface receptors
Mol. Mass.:50647.10
Organism:Homo sapiens (Human)
Description:P14416
Residue:443
BDBM50369668
NameBDBM50369668
Synonyms:CHEMBL1202219
TypeSmall organic molecule
Emp. Form.C20H22ClFN2
Mol. Mass.344.853
SMILESFc1ccc(cc1)[C@H]1C[C@@H]1CN1CCN(CC1)c1ccccc1Cl