Reaction Details
TargetHistamine H3 receptor
LigandBDBM50053278
Substrate/Competitorn/a
Meas. Tech.ChEMBL_86763 (CHEMBL698663)
Ki 12±n/a nM
Citation Stark, HSadek, BKrause, MHüls, ALigneau, XGanellin, CRArrang, JMSchwartz, JCSchunack, W Novel histamine H(3)-receptor antagonists with carbonyl-substituted 4-(3-(phenoxy)propyl)-1H-imidazole structures like ciproxifan and related compounds. J Med Chem43:3987-94 (2000) Histamine H3 receptor
Name:Histamine H3 receptor
Type:G Protein-Coupled Receptor (GPCR)
Mol. Mass.:48607.98
Organism:Rattus norvegicus (rat)
Description:n/a
Residue:445
BDBM50053278
NameBDBM50053278
Synonyms:4-[3-(1H-Imidazol-4-yl)-propoxy]-benzonitrile CHEMBL113030
TypeSmall organic molecule
Emp. Form.C13H13N3O
Mol. Mass.227.2618
SMILESN#Cc1ccc(OCCCc2cnc[nH]2)cc1