Reaction Details
TargetHistamine H3 receptor
LigandBDBM50092865
Substrate/Competitorn/a
Meas. Tech.ChEMBL_86763 (CHEMBL698663)
Ki 7±n/a nM
Citation Stark, HSadek, BKrause, MHüls, ALigneau, XGanellin, CRArrang, JMSchwartz, JCSchunack, W Novel histamine H(3)-receptor antagonists with carbonyl-substituted 4-(3-(phenoxy)propyl)-1H-imidazole structures like ciproxifan and related compounds. J Med Chem43:3987-94 (2000) Histamine H3 receptor
Name:Histamine H3 receptor
Type:G Protein-Coupled Receptor (GPCR)
Mol. Mass.:48607.98
Organism:Rattus norvegicus (rat)
Description:n/a
Residue:445
BDBM50092865
NameBDBM50092865
Synonyms:1-{4-[3-(1H-Imidazol-4-yl)-propoxy]-phenyl}-heptan-1-one; compound with but-2-enedioic acid(0.25M H2O) | CHEMBL449398
TypeSmall organic molecule
Emp. Form.C19H26N2O2
Mol. Mass.314.4219
SMILESCCCCCCC(=O)c1ccc(OCCCc2cnc[nH]2)cc1