Reaction Details
TargetCyclin-dependent kinase 1
LigandBDBM50093414
Substrate/Competitorn/a
Meas. Tech.ChEMBL_50320 (CHEMBL660789)
IC50 210±n/a nM
Citation Ducrot, PLegraverend, MGrierson, DS 3D-QSAR CoMFA on cyclin-dependent kinase inhibitors. J Med Chem43:4098-108 (2000) Cyclin-dependent kinase 1
Name:Cyclin-dependent kinase 1
Type:Enzyme Subunit
Mol. Mass.:34101.08
Organism:Homo sapiens (Human)
Description:P06493
Residue:297
BDBM50093414
NameBDBM50093414
Synonyms:(R){1-[9-Isopropyl-6-(4-methoxy-benzylamino)-9H-purin-2-yl]-pyrrolidin-2-yl}-methanol | CHEMBL3085238
TypeSmall organic molecule
Emp. Form.C21H28N6O2
Mol. Mass.396.486
SMILESCOc1ccc(CNc2nc(nc3n(cnc23)C(C)C)N2CCC[C@@H]2CO)cc1