Reaction Details
TargetCyclin-dependent kinase 1
LigandBDBM7576
Substrate/Competitorn/a
Meas. Tech.ChEMBL_50319 (CHEMBL661624)
IC50 60±n/a nM
Citation Ducrot, PLegraverend, MGrierson, DS 3D-QSAR CoMFA on cyclin-dependent kinase inhibitors. J Med Chem43:4098-108 (2000) Cyclin-dependent kinase 1
Name:Cyclin-dependent kinase 1
Type:Enzyme Subunit
Mol. Mass.:34101.08
Organism:Homo sapiens (Human)
Description:P06493
Residue:297
BDBM7576
NameBDBM7576
Synonyms:1-(6-{[(4-chlorophenyl)methyl]amino}-9-(propan-2-yl)-9H-purin-2-yl)-3-methylpent-1-yn-3-ol 2-purine deriv. 3a CHEMBL24484
TypeSmall organic molecule
Emp. Form.C21H24ClN5O
Mol. Mass.397.901
SMILESCCC(C)(O)C#Cc1nc(NCc2ccc(Cl)cc2)c2ncn(C(C)C)c2n1