Reaction Details
TargetCyclin-dependent kinase 1
LigandBDBM7579
Substrate/Competitorn/a
Meas. Tech.ChEMBL_50319 (CHEMBL661624)
IC50 150±n/a nM
Citation Ducrot, PLegraverend, MGrierson, DS 3D-QSAR CoMFA on cyclin-dependent kinase inhibitors. J Med Chem43:4098-108 (2000) Cyclin-dependent kinase 1
Name:Cyclin-dependent kinase 1
Type:Enzyme Subunit
Mol. Mass.:34101.08
Organism:Homo sapiens (Human)
Description:P06493
Residue:297
BDBM7579
NameBDBM7579
Synonyms:1-(6-{[4-(dimethylamino)benzyl]amino}-9-isopropyl-9H-purin-2-yl)-3-methylpent-1-yn-3-ol C-2 alkynylated purine deriv. 4h | CHEMBL23525
TypeSmall organic molecule
Emp. Form.C23H30N6O
Mol. Mass.406.5239
SMILESCCC(C)(O)C#Cc1nc(NCc2ccc(cc2)N(C)C)c2ncn(C(C)C)c2n1