Reaction Details
TargetCyclin-dependent kinase 1
LigandBDBM7582
Substrate/Competitorn/a
Meas. Tech.ChEMBL_50319 (CHEMBL661624)
IC50 200±n/a nM
Citation Ducrot, PLegraverend, MGrierson, DS 3D-QSAR CoMFA on cyclin-dependent kinase inhibitors. J Med Chem43:4098-108 (2000) Cyclin-dependent kinase 1
Name:Cyclin-dependent kinase 1
Type:Enzyme Subunit
Mol. Mass.:34101.08
Organism:Homo sapiens (Human)
Description:P06493
Residue:297
BDBM7582
NameBDBM7582
Synonyms:1-{6-[(4-ethoxyphenyl)amino]-9-(propan-2-yl)-9H-purin-2-yl}-3-methylpent-1-yn-3-ol C-2 alkynylated purine deriv. 5c | CHEMBL280623
TypeSmall organic molecule
Emp. Form.C22H27N5O2
Mol. Mass.393.4821
SMILESCCOc1ccc(Nc2nc(nc3n(cnc23)C(C)C)C#CC(C)(O)CC)cc1