Reaction Details
TargetCarbonic anhydrase 4
LigandBDBM50094379
Substrate/Competitorn/a
Meas. Tech.ChEMBL_45431 (CHEMBL657032)
Ki 12±n/a nM
Citation Scozzafava, AMenabuoni, LMincione, FBriganti, FMincione, GSupuran, CT Carbonic anhydrase inhibitors: perfluoroalkyl/aryl-substituted derivatives of aromatic/heterocyclic sulfonamides as topical intraocular pressure-lowering agents with prolonged duration of action. J Med Chem43:4542-51 (2000) Carbonic anhydrase 4
Name:Carbonic anhydrase 4
Type:Enzyme
Mol. Mass.:35152.74
Organism:Bos taurus (bovine)
Description:Bovine isozyme, isolated from lung microsomes
Residue:312
BDBM50094379
NameBDBM50094379
Synonyms:2,2,3,3,4,4,5,5,6,6,7,7,8,8,9,9,9-Heptadecafluoro-nonanoic acid [4-(3-methyl-5-sulfamoyl-3H-[1,3,4]thiadiazol-2-ylidenesulfamoyl)-phenyl]-amide | CHEMBL138847
TypeSmall organic molecule
Emp. Form.C18H10F17N5O5S3
Mol. Mass.795.47
SMILESCn1nc(s\c1=N\S(=O)(=O)c1ccc(NC(=O)C(F)(F)C(F)(F)C(F)(F)C(F)(F)C(F)(F)C(F)(F)C(F)(F)C(F)(F)F)cc1)S(N)(=O)=O