Reaction Details
TargetCarbonic anhydrase 2
LigandBDBM50094418
Substrate/Competitorn/a
Meas. Tech.ChEMBL_45236 (CHEMBL657194)
Ki 1.5±n/a nM
Citation Scozzafava, AMenabuoni, LMincione, FBriganti, FMincione, GSupuran, CT Carbonic anhydrase inhibitors: perfluoroalkyl/aryl-substituted derivatives of aromatic/heterocyclic sulfonamides as topical intraocular pressure-lowering agents with prolonged duration of action. J Med Chem43:4542-51 (2000) Carbonic anhydrase 2
Name:Carbonic anhydrase 2
Type:Enzyme
Mol. Mass.:29250.71
Organism:Homo sapiens (Human)
Description:P00918
Residue:260
BDBM50094418
NameBDBM50094418
Synonyms:4-Methyl-5-(4-pentafluorobenzenesulfonylamino-benzenesulfonylimino)-4,5-dihydro-[1,3,4]thiadiazole-2-sulfonic acid amide | CHEMBL138603
TypeSmall organic molecule
Emp. Form.C15H10F5N5O6S4
Mol. Mass.579.522
SMILESCn1nc(s\c1=N\S(=O)(=O)c1ccc(NS(=O)(=O)c2c(F)c(F)c(F)c(F)c2F)cc1)S(N)(=O)=O