Reaction Details
TargetCarbonic anhydrase 2
LigandBDBM50094432
Substrate/Competitorn/a
Meas. Tech.ChEMBL_45236 (CHEMBL657194)
Ki 0.6±n/a nM
Citation Scozzafava, AMenabuoni, LMincione, FBriganti, FMincione, GSupuran, CT Carbonic anhydrase inhibitors: perfluoroalkyl/aryl-substituted derivatives of aromatic/heterocyclic sulfonamides as topical intraocular pressure-lowering agents with prolonged duration of action. J Med Chem43:4542-51 (2000) Carbonic anhydrase 2
Name:Carbonic anhydrase 2
Type:Enzyme
Mol. Mass.:29250.71
Organism:Homo sapiens (Human)
Description:P00918
Residue:260
BDBM50094432
NameBDBM50094432
Synonyms:2,3,4,5,6-Pentafluoro-benzoic acid 2-sulfamoyl-benzothiazol-6-yl ester | CHEMBL140095
TypeSmall organic molecule
Emp. Form.C14H5F5N2O4S2
Mol. Mass.424.323
SMILESNS(=O)(=O)c1nc2ccc(OC(=O)c3c(F)c(F)c(F)c(F)c3F)cc2s1