Reaction Details
TargetCarbonic anhydrase 1
LigandBDBM50094379
Substrate/Competitorn/a
Meas. Tech.ChEMBL_44853 (CHEMBL653167)
Ki 900±n/a nM
Citation Scozzafava, AMenabuoni, LMincione, FBriganti, FMincione, GSupuran, CT Carbonic anhydrase inhibitors: perfluoroalkyl/aryl-substituted derivatives of aromatic/heterocyclic sulfonamides as topical intraocular pressure-lowering agents with prolonged duration of action. J Med Chem43:4542-51 (2000) Carbonic anhydrase 1
Name:Carbonic anhydrase 1
Type:Enzyme
Mol. Mass.:28873.37
Organism:Homo sapiens (Human)
Description:P00915
Residue:261
BDBM50094379
NameBDBM50094379
Synonyms:2,2,3,3,4,4,5,5,6,6,7,7,8,8,9,9,9-Heptadecafluoro-nonanoic acid [4-(3-methyl-5-sulfamoyl-3H-[1,3,4]thiadiazol-2-ylidenesulfamoyl)-phenyl]-amide | CHEMBL138847
TypeSmall organic molecule
Emp. Form.C18H10F17N5O5S3
Mol. Mass.795.47
SMILESCn1nc(s\c1=N\S(=O)(=O)c1ccc(NC(=O)C(F)(F)C(F)(F)C(F)(F)C(F)(F)C(F)(F)C(F)(F)C(F)(F)C(F)(F)F)cc1)S(N)(=O)=O