Reaction Details
TargetGenome polyprotein
LigandBDBM50084614
Substrate/Competitorn/a
Meas. Tech.ChEMBL_158777 (CHEMBL772934)
IC50 640±n/a nM
Citation Leung, DAbbenante, GFairlie, DP Protease inhibitors: current status and future prospects. J Med Chem43:305-41 (2000) Genome polyprotein
Name:Genome polyprotein
Type:PROTEIN
Mol. Mass.:44361.04
Organism:Human rhinovirus B
Description:ChEMBL_158953
Residue:401
BDBM50084614
NameBDBM50084614
Synonyms:4-(2-Acetylamino-3-carboxy-propionylamino)-4-(1-{3-carboxy-1-[1-(1-carboxy-2-mercapto-ethylcarbamoyl)-2-cyclohexyl-ethylcarbamoyl]-propylcarbamoyl}-2,2-diphenyl-ethylcarbamoyl)-butyric acid | CHEMBL324520
TypeSmall organic molecule
Emp. Form.C38H57N7O11
Mol. Mass.787.8995
SMILESCCCC(NC(=O)[C@@H]1CCCN1C(=O)[C@@H](NC(=O)[C@@H](NC(=O)[C@@H](CC(O)=O)NC(=O)[C@H](CC(O)=O)NC(C)=O)C(C)CC)C(C)C)C(=O)NCc1ccccc1