Reaction Details
TargetStromelysin-1
LigandBDBM8465
Substrate/Competitorn/a
Meas. Tech.ChEMBL_104750 (CHEMBL715875)
Ki 43±n/a nM
Citation Leung, DAbbenante, GFairlie, DP Protease inhibitors: current status and future prospects. J Med Chem43:305-41 (2000) Stromelysin-1
Name:Stromelysin-1
Type:Enzyme
Mol. Mass.:53973.13
Organism:Homo sapiens (Human)
Description: P08254
Residue:477
BDBM8465
NameBDBM8465
Synonyms:(2R)-N-hydroxy-2-[(4-methoxybenzene)(pyridin-3-ylmethyl)sulfonamido]-3-methylbutanamide CGS 27023 CHEMBL514138 | hydroxamate analogue 1
TypeSmall organic molecule
Emp. Form.C18H23N3O5S
Mol. Mass.393.457
SMILESCOc1ccc(cc1)S(=O)(=O)N(Cc1cccnc1)[C@H](C(C)C)C(=O)NO