Reaction Details
TargetAngiotensin-converting enzyme
LigandBDBM50084622
Substrate/Competitorn/a
Meas. Tech.ChEMBL_36899 (CHEMBL648689)
IC50 1±n/a nM
Citation Leung, DAbbenante, GFairlie, DP Protease inhibitors: current status and future prospects. J Med Chem43:305-41 (2000) Angiotensin-converting enzyme
Name:Angiotensin-converting enzyme
Type:Enzyme
Mol. Mass.:149709.01
Organism:Homo sapiens (Human)
Description:n/a
Residue:1306
BDBM50084622
NameBDBM50084622
Synonyms:(2S,4S)-4-cyclohexyl-1-[2-[(2-methyl-1-propanoyloxypropoxy)-(4-phenylbutyl)phosphoryl]acetyl]pyrrolidine-2-carboxylic acid (4S)-4-cyclohexyl-1-({[2-methyl-1-(propanoyloxy)propoxy](4-phenylbutyl)phosphoryl}acetyl)-L-proline | Fosinopril
TypeSmall organic molecule
Emp. Form.C29H44NO7P
Mol. Mass.549.6359
SMILESCCC(=O)OC(OP(=O)(CCCc1ccccc1)CC(=O)N1C[C@@H](C[C@H]1C(O)=O)C1CCCCC1)C(C)C