Reaction Details
TargetCalpain-1 catalytic subunit
LigandBDBM50084623
Substrate/Competitorn/a
Meas. Tech.ChEMBL_217823 (CHEMBL821730)
IC50 28±n/a nM
Citation Leung, DAbbenante, GFairlie, DP Protease inhibitors: current status and future prospects. J Med Chem43:305-41 (2000) Calpain-1 catalytic subunit
Name:Calpain-1 catalytic subunit
Type:Protein
Mol. Mass.:81880.51
Organism:Homo sapiens (Human)
Description:n/a
Residue:714
BDBM50084623
NameBDBM50084623
Synonyms:4-Azido-1-(toluene-4-sulfonyl)-pyrrolidine-2-carboxylic acid (1-formyl-2-phenyl-ethyl)-amide | CHEMBL115073
TypeSmall organic molecule
Emp. Form.C21H23N5O4S
Mol. Mass.441.503
SMILESCc1ccc(cc1)S(=O)(=O)N1CC(CC1C(=O)N[C@@H](Cc1ccccc1)C=O)N=[N+]=[N-]