Reaction Details
TargetGenome polyprotein
LigandBDBM50065674
Substrate/Competitorn/a
Meas. Tech.ChEMBL_161095 (CHEMBL771556)
EC50 56±n/a nM
Citation Leung, DAbbenante, GFairlie, DP Protease inhibitors: current status and future prospects. J Med Chem43:305-41 (2000) Genome polyprotein
Name:Genome polyprotein
Type:PROTEIN
Mol. Mass.:44361.04
Organism:Human rhinovirus B
Description:ChEMBL_158953
Residue:401
BDBM50065674
NameBDBM50065674
Synonyms:(E)-(S)-6-Carbamoyl-4-[(S)-2-((S)-2-cyclopentylsulfanylcarbonylamino-3,3-dimethyl-butyrylamino)-3-p-tolyl-propionylamino]-hex-2-enoic acid ethyl ester CHEMBL95145
TypeSmall organic molecule
Emp. Form.C31H46N4O6S
Mol. Mass.602.785
SMILESCCOC(=O)\C=C\[C@H](CCC(N)=O)NC(=O)[C@H](Cc1ccc(C)cc1)NC(=O)[C@@H](NC(=O)SC1CCCC1)C(C)(C)C