Reaction Details
TargetNeutrophil elastase
LigandBDBM50058491
Substrate/Competitorn/a
Meas. Tech.ChEMBL_64835 (CHEMBL678414)
Ki 0.45±n/a nM
Citation Leung, DAbbenante, GFairlie, DP Protease inhibitors: current status and future prospects. J Med Chem43:305-41 (2000) Neutrophil elastase
Name:Neutrophil elastase
Type:Enzyme
Mol. Mass.:28532.38
Organism:Homo sapiens (Human)
Description:P08246
Residue:267
BDBM50058491
NameBDBM50058491
Synonyms:3-{4-[2-(4-{1-[4-(2-Carboxy-2-methyl-propane-1-sulfonyl)-phenoxycarbonyl]-1-methyl-ethyl}-phenyl)-2-methyl-propionyloxy]-benzenesulfonyl}-2,2-dimethyl-propionic acid CHEMBL56605
TypeSmall organic molecule
Emp. Form.C36H42O12S2
Mol. Mass.730.841
SMILESCC(C)(CS(=O)(=O)c1ccc(OC(=O)C(C)(C)c2ccc(cc2)C(C)(C)C(=O)Oc2ccc(cc2)S(=O)(=O)CC(C)(C)C(O)=O)cc1)C(O)=O