Reaction Details
TargetStromelysin-1
LigandBDBM50084641
Substrate/Competitorn/a
Meas. Tech.ChEMBL_104750 (CHEMBL715875)
Ki 30±n/a nM
Citation Leung, DAbbenante, GFairlie, DP Protease inhibitors: current status and future prospects. J Med Chem43:305-41 (2000) Stromelysin-1
Name:Stromelysin-1
Type:Enzyme
Mol. Mass.:53973.13
Organism:Homo sapiens (Human)
Description: P08254
Residue:477
BDBM50084641
NameBDBM50084641
Synonyms:(4-Benzyl-benzyl)-[2-(2,2-dimethyl-1-methylcarbamoyl-propylcarbamoyl)-6-phenoxy-hexyl]-phosphinic acid | CHEMBL114944
TypeSmall organic molecule
Emp. Form.C34H45N2O5P
Mol. Mass.592.7053
SMILESCNC(=O)[C@@H](NC(=O)[C@H](CCCCOc1ccccc1)CP(O)(=O)Cc1ccc(Cc2ccccc2)cc1)C(C)(C)C