Reaction Details
TargetSerine protease 1
LigandBDBM17283
Substrate/Competitorn/a
Meas. Tech.ChEMBL_213067 (CHEMBL817134)
Ki 620±n/a nM
Citation Leung, DAbbenante, GFairlie, DP Protease inhibitors: current status and future prospects. J Med Chem43:305-41 (2000) Serine protease 1
Name:Serine protease 1
Type:Enzyme
Mol. Mass.:26557.80
Organism:Homo sapiens (Human)
Description:P07477
Residue:247
BDBM17283
NameBDBM17283
Synonyms:(2S)-3-(7-carbamimidoylnaphthalen-2-yl)-2-(4-{[(3S)-1-ethanimidoylpyrrolidin-3-yl]oxy}phenyl)propanoic acid DX-9065a
TypeSmall organic molecule
Emp. Form.C26H28N4O3
Mol. Mass.444.5255
SMILESCC(=N)N1CC[C@@H](C1)Oc1ccc(cc1)[C@H](Cc1ccc2ccc(cc2c1)C(N)=N)C(O)=O