Reaction Details
TargetStromelysin-1
LigandBDBM50066659
Substrate/Competitorn/a
Meas. Tech.ChEMBL_104750 (CHEMBL715875)
Ki 18±n/a nM
Citation Leung, DAbbenante, GFairlie, DP Protease inhibitors: current status and future prospects. J Med Chem43:305-41 (2000) Stromelysin-1
Name:Stromelysin-1
Type:Enzyme
Mol. Mass.:53973.13
Organism:Homo sapiens (Human)
Description: P08254
Residue:477
BDBM50066659
NameBDBM50066659
Synonyms:1,3-BIS-(4-METHOXY-BENZENESULFONYL)-5,5-DIMETHYL-HEXAHYDRO-PYRIMIDINE-2-CARBOXYLIC ACID HYDROXYAMIDE MMP inhibitor II
TypeSmall organic molecule
Emp. Form.C21H27N3O8S2
Mol. Mass.513.584
SMILESCOc1ccc(cc1)S(=O)(=O)N1CC(C)(C)CN(C1C(=O)NO)S(=O)(=O)c1ccc(OC)cc1