Reaction Details
TargetGenome polyprotein
LigandBDBM50084657
Substrate/Competitorn/a
Meas. Tech.ChEMBL_161096 (CHEMBL771557)
EC50>5600±n/a nM
Citation Leung, DAbbenante, GFairlie, DP Protease inhibitors: current status and future prospects. J Med Chem43:305-41 (2000) Genome polyprotein
Name:Genome polyprotein
Type:PROTEIN
Mol. Mass.:44361.04
Organism:Human rhinovirus B
Description:ChEMBL_158953
Residue:401
BDBM50084657
NameBDBM50084657
Synonyms:1-Benzo[b]thiophen-6-ylmethyl-2,3-dioxo-2,3-dihydro-1H-indole-5-carboxylic acid amide | CHEMBL117484
TypeSmall organic molecule
Emp. Form.C18H12N2O3S
Mol. Mass.336.364
SMILESNC(=O)c1ccc2N(Cc3ccc4ccsc4c3)C(=O)C(=O)c2c1