Reaction Details
TargetNeprilysin
LigandBDBM50084666
Substrate/Competitorn/a
Meas. Tech.ChEMBL_64981 (CHEMBL675566)
IC50 63±n/a nM
Citation Leung, DAbbenante, GFairlie, DP Protease inhibitors: current status and future prospects. J Med Chem43:305-41 (2000) Neprilysin
Name:Neprilysin
Type:Protein
Mol. Mass.:85789.59
Organism:Rattus norvegicus (Rat)
Description:P07861
Residue:750
BDBM50084666
NameBDBM50084666
Synonyms:CHEMBL114658 | [6-(2-Mercapto-3-phenyl-propionylamino)-2,2-dimethyl-7-oxo-azepan-1-yl]-acetic acid
TypeSmall organic molecule
Emp. Form.C19H26N2O4S
Mol. Mass.378.486
SMILESCC1(C)CCCC(NC(=O)[C@@H](S)Cc2ccccc2)C(=O)N1CC(O)=O