Reaction Details
TargetStromelysin-1
LigandBDBM50084665
Substrate/Competitorn/a
Meas. Tech.ChEMBL_104719 (CHEMBL710129)
IC50 200±n/a nM
Citation Leung, DAbbenante, GFairlie, DP Protease inhibitors: current status and future prospects. J Med Chem43:305-41 (2000) Stromelysin-1
Name:Stromelysin-1
Type:Enzyme
Mol. Mass.:53973.13
Organism:Homo sapiens (Human)
Description: P08254
Residue:477
BDBM50084665
NameBDBM50084665
Synonyms:CHEMBL115189 | N*4*-(2,2-Dimethyl-1-methylcarbamoyl-propyl)-2,N*1*-dihydroxy-3-isobutyl-succinamide(Marimisant)
TypeSmall organic molecule
Emp. Form.C15H29N3O5
Mol. Mass.331.4079
SMILESCNC(=O)C(NC(=O)[C@H](CC(C)C)[C@H](O)C(=O)NO)C(C)(C)C