Reaction Details
TargetCoagulation factor X
LigandBDBM50084676
Substrate/Competitorn/a
Meas. Tech.ChEMBL_48981 (CHEMBL663511)
IC50 270±n/a nM
Citation Leung, DAbbenante, GFairlie, DP Protease inhibitors: current status and future prospects. J Med Chem43:305-41 (2000) Coagulation factor X
Name:Coagulation factor X
Type:Enzyme
Mol. Mass.:54726.60
Organism:Homo sapiens (Human)
Description:n/a
Residue:488
BDBM50084676
NameBDBM50084676
Synonyms:(2S)-(3'-AMIDINO-3-BIPHENYL)-5-(4-PYRIDYLAMINO)PENTANOIC ACID 2-(3'-Carbamimidoyl-biphenyl-3-yl)-5-(pyridin-4-ylamino)-pentanoic acid(FX-2212) | CHEMBL105532
TypeSmall organic molecule
Emp. Form.C23H24N4O2
Mol. Mass.388.4623
SMILESNC(=N)c1cccc(c1)-c1cccc(c1)[C@H](CCCNc1ccncc1)C(O)=O