Reaction Details
TargetRenin
LigandBDBM50084669
Substrate/Competitorn/a
Meas. Tech.ChEMBL_195962 (CHEMBL806856)
IC50 500±n/a nM
Citation Leung, DAbbenante, GFairlie, DP Protease inhibitors: current status and future prospects. J Med Chem43:305-41 (2000) Renin
Name:Renin
Type:Enzyme
Mol. Mass.:45058.99
Organism:Homo sapiens (Human)
Description:n/a
Residue:406
BDBM50084669
NameBDBM50084669
Synonyms:8-(4-{4-[3-(2-Methoxy-benzyloxy)-propoxy]-phenyl}-piperidin-3-yloxymethyl)-1,2,3,4-tetrahydro-quinoline | CHEMBL424437
TypeSmall organic molecule
Emp. Form.C32H40N2O4
Mol. Mass.516.671
SMILESCOc1ccccc1COCCCOc1ccc(cc1)C1CCNCC1OCc1cccc2CCCNc12