Reaction Details
TargetGenome polyprotein
LigandBDBM50084671
Substrate/Competitorn/a
Meas. Tech.ChEMBL_161095 (CHEMBL771556)
EC50 5±n/a nM
Citation Leung, DAbbenante, GFairlie, DP Protease inhibitors: current status and future prospects. J Med Chem43:305-41 (2000) Genome polyprotein
Name:Genome polyprotein
Type:PROTEIN
Mol. Mass.:44361.04
Organism:Human rhinovirus B
Description:ChEMBL_158953
Residue:401
BDBM50084671
NameBDBM50084671
Synonyms:4-{2-(4-Fluoro-benzyl)-7-methyl-5-[(5-methyl-isoxazole-3-carbonyl)-amino]-4-oxo-octanoylamino}-5-(2-oxo-pyrrolidin-3-yl)-pent-2-enoic acid ethyl ester(AG7088) | CHEMBL327058
TypeSmall organic molecule
Emp. Form.C32H41FN4O7
Mol. Mass.612.6889
SMILESCCOC(=O)\C=C\[C@H](C[C@@H]1CCNC1=O)NC(=O)[C@@H](CC(=O)[C@H](CC(C)C)NC(=O)c1cc(C)on1)Cc1ccc(F)cc1