Reaction Details
TargetNeprilysin
LigandBDBM50024102
Substrate/Competitorn/a
Meas. Tech.ChEMBL_64981 (CHEMBL675566)
IC50 4±n/a nM
Citation Leung, DAbbenante, GFairlie, DP Protease inhibitors: current status and future prospects. J Med Chem43:305-41 (2000) Neprilysin
Name:Neprilysin
Type:Protein
Mol. Mass.:85789.59
Organism:Rattus norvegicus (Rat)
Description:P07861
Residue:750
BDBM50024102
NameBDBM50024102
Synonyms:((S)-2-Mercaptomethyl-3-phenyl-propionylamino)-acetic acid (S) (2-Mercaptomethyl-3-phenyl-propionylamino)-acetic acid CHEMBL298827
TypeSmall organic molecule
Emp. Form.C12H15NO3S
Mol. Mass.253.317
SMILESOC(=O)CNC(=O)[C@@H](CS)Cc1ccccc1