Reaction Details
TargetNeutrophil elastase
LigandBDBM50084637
Substrate/Competitorn/a
Meas. Tech.ChEMBL_63799 (CHEMBL679051)
IC50 44±n/a nM
Citation Leung, DAbbenante, GFairlie, DP Protease inhibitors: current status and future prospects. J Med Chem43:305-41 (2000) Neutrophil elastase
Name:Neutrophil elastase
Type:Enzyme
Mol. Mass.:28532.38
Organism:Homo sapiens (Human)
Description:P08246
Residue:267
BDBM50084637
NameBDBM50084637
Synonyms:2,2-Dimethyl-propionic acid 4-[2-(carboxymethyl-carbamoyl)-phenylsulfamoyl]-phenyl ester CHEMBL76688 Sivelestat
TypeSmall organic molecule
Emp. Form.C20H22N2O7S
Mol. Mass.434.463
SMILESCC(C)(C)C(=O)Oc1ccc(cc1)S(=O)(=O)Nc1ccccc1C(=O)NCC(O)=O