Reaction Details
TargetGenome polyprotein
LigandBDBM50084675
Substrate/Competitorn/a
Meas. Tech.ChEMBL_161230 (CHEMBL764325)
EC50 1300±n/a nM
Citation Leung, DAbbenante, GFairlie, DP Protease inhibitors: current status and future prospects. J Med Chem43:305-41 (2000) Genome polyprotein
Name:Genome polyprotein
Type:PROTEIN
Mol. Mass.:44361.04
Organism:Human rhinovirus B
Description:ChEMBL_158953
Residue:401
BDBM50084675
NameBDBM50084675
Synonyms:CHEMBL114869 | {1-[1-(1-Dimethylcarbamoylmethyl-2-oxo-ethylcarbamoyl)-2-phenyl-ethylcarbamoyl]-3-methyl-butyl}-carbamic acid benzyl ester
TypeSmall organic molecule
Emp. Form.C29H38N4O6
Mol. Mass.538.6352
SMILESCC(C)C[C@H](NC(=O)OCc1ccccc1)C(=O)N[C@@H](Cc1ccccc1)C(=O)N[C@@H](CC(=O)N(C)C)C=O