Reaction Details
TargetCathepsin D
LigandBDBM7974
Substrate/Competitorn/a
Meas. Tech.ChEMBL_45182 (CHEMBL658681)
IC50 21±n/a nM
Citation Leung, DAbbenante, GFairlie, DP Protease inhibitors: current status and future prospects. J Med Chem43:305-41 (2000) Cathepsin D
Name:Cathepsin D
Type:Enzyme
Mol. Mass.:44551.72
Organism:Homo sapiens (Human)
Description:Human proCathepsin D (SwissProt accession number P07339) was expressed in Sf9 cells, purified, and autoactivated.
Residue:412
BDBM7974
NameBDBM7974
Synonyms:(3S,4S)-N-[(1S)-1-{[(1S)-1-carbamoyl-3-methylbutyl]carbamoyl}ethyl]-3-hydroxy-4-[(2S)-3-methyl-2-(pyridin-2-ylformamido)butanamido]-5-phenylpentanamide Statine-like inhibitor A
TypeSmall organic molecule
Emp. Form.C31H44N6O6
Mol. Mass.596.7177
SMILESCC(C)C[C@H](NC(=O)[C@H](C)NC(=O)C[C@H](O)[C@H](Cc1ccccc1)NC(=O)[C@@H](NC(=O)c1ccccn1)C(C)C)C(N)=O