Reaction Details
TargetAnionic trypsin
LigandBDBM50037991
Substrate/Competitorn/a
Meas. Tech.ChEMBL_212176 (CHEMBL815151)
Ki 1900±n/a nM
Citation Leung, DAbbenante, GFairlie, DP Protease inhibitors: current status and future prospects. J Med Chem43:305-41 (2000) Anionic trypsin
Name:Anionic trypsin
Type:PROTEIN
Mol. Mass.:26281.39
Organism:Bos taurus
Description:ChEMBL_212177
Residue:247
BDBM50037991
NameBDBM50037991
Synonyms:CHEMBL325166 Ro-46-6240 {[3-[(1-Carbamimidoyl-piperidin-3-ylmethyl)-carbamoyl]-2-(naphthalene-2-sulfonylamino)-propionyl]-cyclopropyl-amino}-acetic acid(napsagatran(RO46-6240))
TypeSmall organic molecule
Emp. Form.C26H34N6O6S
Mol. Mass.558.65
SMILESNC(=N)N1CCC[C@@H](CNC(=O)C[C@H](NS(=O)(=O)c2ccc3ccccc3c2)C(=O)N(CC(O)=O)C2CC2)C1