Reaction Details
TargetCathepsin B
LigandBDBM50084650
Substrate/Competitorn/a
Meas. Tech.ChEMBL_47412 (CHEMBL657289)
IC50 85.10±n/a nM
Citation Leung, DAbbenante, GFairlie, DP Protease inhibitors: current status and future prospects. J Med Chem43:305-41 (2000) Cathepsin B
Name:Cathepsin B
Type:Enzyme
Mol. Mass.:37819.69
Organism:Homo sapiens (Human)
Description:gi_63102437
Residue:339
BDBM50084650
NameBDBM50084650
Synonyms:CHEMBL177914 {1-[1-Formyl-2-(4-hydroxy-phenyl)-ethylcarbamoyl]-2-phenyl-ethyl}-carbamic acid benzyl ester(Cbz-Phe-Tyr-CHO)
TypeSmall organic molecule
Emp. Form.C26H26N2O5
Mol. Mass.446.495
SMILESOc1ccc(C[C@H](NC(=O)[C@H](Cc2ccccc2)NC(=O)OCc2ccccc2)C=O)cc1