Reaction Details
TargetProthrombin
LigandBDBM50063698
Substrate/Competitorn/a
Meas. Tech.ChEMBL_208875 (CHEMBL814933)
IC50 1900±n/a nM
Citation Leung, DAbbenante, GFairlie, DP Protease inhibitors: current status and future prospects. J Med Chem43:305-41 (2000) Prothrombin
Name:Prothrombin
Type:Protein
Mol. Mass.:70029.57
Organism:Homo sapiens (Human)
Description:P00734
Residue:622
BDBM50063698
NameBDBM50063698
Synonyms:4-Guanidino-benzoic acid 6-carbamimidoyl-naphthalen-2-yl ester CHEMBL273264 | Nafamostat
TypeSmall organic molecule
Emp. Form.C19H17N5O2
Mol. Mass.347.3706
SMILES[#7]\[#6](-[#7])=[#7]/c1ccc(cc1)-[#6](=O)-[#8]-c1ccc2cc(ccc2c1)-[#6](-[#7])=[#7]