Reaction Details
TargetPapain
LigandBDBM50066650
Substrate/Competitorn/a
Meas. Tech.ChEMBL_152662 (CHEMBL761587)
Ki>10000±n/a nM
Citation Leung, DAbbenante, GFairlie, DP Protease inhibitors: current status and future prospects. J Med Chem43:305-41 (2000) Papain
Name:Papain
Type:Enzyme
Mol. Mass.:38923.01
Organism:Carica papaya
Description:Papain was purchased from Sigma, Germany.
Residue:345
BDBM50066650
NameBDBM50066650
Synonyms:1,3-BIS[[N-[(PHENYLMETHOXY)CARBONYL]-L-LEUCYL]AMINO]-2-PROPANONE {(S)-1-[3-((S)-2-Benzyloxycarbonylamino-4-methyl-pentanoylamino)-2-oxo-propylcarbamoyl]-3-methyl-butyl}-carbamic acid benzyl ester | {1-[3-(2-Benzyloxycarbonylamino-4-methyl-pentanoylamino)-2-oxo-propylcarbamoyl]-3-methyl-butyl}-carbamic acid benzyl ester
TypeSmall organic molecule
Emp. Form.C31H42N4O7
Mol. Mass.582.6878
SMILESCC(C)C[C@H](NC(=O)OCc1ccccc1)C(=O)NCC(=O)CNC(=O)[C@H](CC(C)C)NC(=O)OCc1ccccc1