Reaction Details
TargetSodium/glucose cotransporter 1
LigandBDBM50422347
Substrate/Competitorn/a
Meas. Tech.ChEMBL_202730 (CHEMBL809058)
Ki 152000±n/a nM
Citation Wielert-Badt, SLin, JTLorenz, MFritz, SKinne, RK Probing the conformation of the sugar transport inhibitor phlorizin by 2D-NMR, molecular dynamics studies, and pharmacophore analysis. J Med Chem43:1692-8 (2000) Sodium/glucose cotransporter 1
Name:Sodium/glucose cotransporter 1
Type:Protein
Mol. Mass.:73503.78
Organism:Homo sapiens (Human)
Description:P13866
Residue:664
BDBM50422347
NameBDBM50422347
Synonyms:CHEMBL2303992
TypeSmall organic molecule
Emp. Form.C21H25NO13S
Mol. Mass.531.487
SMILESNc1cc(CCC(=O)c2c(O)cc(O)cc2O[C@@H]2O[C@@H](CO)[C@@H](O)[C@H](O)[C@@H]2O)cc(c1O)S(O)(=O)=O