Reaction Details
TargetSodium/glucose cotransporter 1
LigandBDBM50422349
Substrate/Competitorn/a
Meas. Tech.ChEMBL_202730 (CHEMBL809058)
Ki 7000±n/a nM
Citation Wielert-Badt, SLin, JTLorenz, MFritz, SKinne, RK Probing the conformation of the sugar transport inhibitor phlorizin by 2D-NMR, molecular dynamics studies, and pharmacophore analysis. J Med Chem43:1692-8 (2000) Sodium/glucose cotransporter 1
Name:Sodium/glucose cotransporter 1
Type:Protein
Mol. Mass.:73503.78
Organism:Homo sapiens (Human)
Description:P13866
Residue:664
BDBM50422349
NameBDBM50422349
Synonyms:CHEMBL2303986
TypeSmall organic molecule
Emp. Form.C23H26INO11
Mol. Mass.619.3571
SMILESOC[C@@H]1O[C@@H](Oc2cc(O)cc(O)c2C(=O)CCc2ccc(O)c(NC(=O)CI)c2)[C@@H](O)[C@@H](O)[C@@H]1O