Reaction Details
TargetKappa-type opioid receptor
LigandBDBM50103978
Substrate/Competitorn/a
Meas. Tech.ChEMBL_146514 (CHEMBL754623)
Ki 0.322±n/a nM
Citation Lu, YNguyen, TMWeltrowska, GBerezowska, ILemieux, CChung, NNSchiller, PW [2',6'-Dimethyltyrosine]dynorphin A(1-11)-NH2 analogues lacking an N-terminal amino group: potent and selective kappa opioid antagonists. J Med Chem44:3048-53 (2001) Kappa-type opioid receptor
Name:Kappa-type opioid receptor
Type:G Protein-Coupled Receptor (GPCR)
Mol. Mass.:42744.99
Organism:Cavia porcellus (domestic guinea pig)
Description:P41144
Residue:380
BDBM50103978
NameBDBM50103978
Synonyms:CHEMBL436911 | [Dmt1]Dyn A(1-11)-NH2
TypeSmall organic molecule
Emp. Form.C65H108N22O12
Mol. Mass.1389.6932
SMILESCC[C@H](C)[C@H](NC(=O)[C@H](CCCNC(N)=N)NC(=O)[C@H](CCCNC(N)=N)NC(=O)[C@H](CC(C)C)NC(=O)[C@H](Cc1ccccc1)NC(=O)CNC(=O)CNC(=O)[C@@H](N)Cc1c(C)cc(O)cc1C)C(=O)N[C@@H](CCCNC(N)=N)C(=O)N1CCC[C@H]1C(=O)N[C@@H](CCCCN)C(N)=O