Reaction Details
Target5-hydroxytryptamine receptor 1A
LigandBDBM50095818
Substrate/Competitorn/a
Meas. Tech.ChEMBL_1422 (CHEMBL616210)
Ki 3.6±n/a nM
Citation López-Rodríguez, MLMorcillo, MJFernández, EPorras, EOrensanz, LBeneytez, MEManzanares, JFuentes, JA Synthesis and structure-activity relationships of a new model of arylpiperazines. 5. Study of the physicochemical influence of the pharmacophore on 5-HT(1a)/alpha(1)-adrenergic receptor affinity: synthesis of a new derivative with mixed 5-HT(1a)/d(2) antagonist properties. J Med Chem44:186-97 (2001) 5-hydroxytryptamine receptor 1A
Name:5-hydroxytryptamine receptor 1A
Type:G Protein-Coupled Receptor (GPCR)
Mol. Mass.:46445.29
Organism:Rattus norvegicus (rat)
Description:Binding assays were performed using rat hippocampal membranes.
Residue:422
BDBM50095818
NameBDBM50095818
Synonyms:2-{4-[4-(3-Trifluoromethyl-phenyl)-piperazin-1-yl]-butyl}-hexahydro-pyrrolo[1,2-a]pyrazine-1,4-dione CHEMBL61250
TypeSmall organic molecule
Emp. Form.C22H29F3N4O2
Mol. Mass.438.4865
SMILESFC(F)(F)c1cccc(c1)N1CCN(CCCCN2CC(=O)N3CCCC3C2=O)CC1