Reaction Details
Target5-hydroxytryptamine receptor 1A
LigandBDBM50095817
Substrate/Competitorn/a
Meas. Tech.ChEMBL_1422 (CHEMBL616210)
Ki 3.7±n/a nM
Citation López-Rodríguez, MLMorcillo, MJFernández, EPorras, EOrensanz, LBeneytez, MEManzanares, JFuentes, JA Synthesis and structure-activity relationships of a new model of arylpiperazines. 5. Study of the physicochemical influence of the pharmacophore on 5-HT(1a)/alpha(1)-adrenergic receptor affinity: synthesis of a new derivative with mixed 5-HT(1a)/d(2) antagonist properties. J Med Chem44:186-97 (2001) 5-hydroxytryptamine receptor 1A
Name:5-hydroxytryptamine receptor 1A
Type:G Protein-Coupled Receptor (GPCR)
Mol. Mass.:46445.29
Organism:Rattus norvegicus (rat)
Description:Binding assays were performed using rat hippocampal membranes.
Residue:422
BDBM50095817
NameBDBM50095817
Synonyms:2-{4-[4-(1,3-Dioxo-tetrahydro-pyrrolo[1,2-c]imidazol-2-yl)-butyl]-piperazin-1-yl}-benzonitrile CHEMBL61614
TypeSmall organic molecule
Emp. Form.C21H27N5O2
Mol. Mass.381.4714
SMILESOc1c2CCCn2c(=O)n1CCCCN1CCN(CC1)c1ccccc1C#N