Reaction Details
TargetDelta-type opioid receptor
LigandBDBM50105090
Substrate/Competitorn/a
Meas. Tech.ChEMBL_145324 (CHEMBL750412)
IC50 1765±n/a nM
Citation Poulain, RHorvath, DBonnet, BEckhoff, CChapelain, BBodinier, MCDéprez, B From hit to lead. Combining two complementary methods for focused library design. Application to mu opiate ligands. J Med Chem44:3378-90 (2001) Delta-type opioid receptor
Name:Delta-type opioid receptor
Type:G Protein-Coupled Receptor (GPCR)
Mol. Mass.:40382.98
Organism:Homo sapiens (Human)
Description:Competition binding assays were carried out using membrane preparations from transfected HN9.10 cells that constitutively expressed the delta opioid receptor.
Residue:372
BDBM50105090
NameBDBM50105090
Synonyms:3-Methylcarbamoylmethyl-4-oxo-1-phenyl-1,3,8-triaza-spiro[4.5]decane-8-carboxylic acid 6-chloro-benzo[1,3]dioxol-5-ylmethyl ester | CHEMBL114825
TypeSmall organic molecule
Emp. Form.C25H27ClN4O6
Mol. Mass.514.958
SMILESCNC(=O)CN1CN(c2ccccc2)C2(CCN(CC2)C(=O)OCc2cc3OCOc3cc2Cl)C1=O