Reaction Details
TargetDelta-type opioid receptor
LigandBDBM50105070
Substrate/Competitorn/a
Meas. Tech.ChEMBL_145324 (CHEMBL750412)
IC50 3330±n/a nM
Citation Poulain, RHorvath, DBonnet, BEckhoff, CChapelain, BBodinier, MCDéprez, B From hit to lead. Combining two complementary methods for focused library design. Application to mu opiate ligands. J Med Chem44:3378-90 (2001) Delta-type opioid receptor
Name:Delta-type opioid receptor
Type:G Protein-Coupled Receptor (GPCR)
Mol. Mass.:40382.98
Organism:Homo sapiens (Human)
Description:Competition binding assays were carried out using membrane preparations from transfected HN9.10 cells that constitutively expressed the delta opioid receptor.
Residue:372
BDBM50105070
NameBDBM50105070
Synonyms:1-{3-[(6-Chloro-benzo[1,3]dioxol-5-ylmethyl)-amino]-propyl}-1,3-dihydro-benzoimidazol-2-one | CHEMBL114280
TypeSmall organic molecule
Emp. Form.C18H18ClN3O3
Mol. Mass.359.807
SMILESClc1cc2OCOc2cc1CNCCCn1c2ccccc2[nH]c1=O