Reaction Details
TargetDelta-type opioid receptor
LigandBDBM50105086
Substrate/Competitorn/a
Meas. Tech.ChEMBL_145324 (CHEMBL750412)
IC50 1040±n/a nM
Citation Poulain, RHorvath, DBonnet, BEckhoff, CChapelain, BBodinier, MCDéprez, B From hit to lead. Combining two complementary methods for focused library design. Application to mu opiate ligands. J Med Chem44:3378-90 (2001) Delta-type opioid receptor
Name:Delta-type opioid receptor
Type:G Protein-Coupled Receptor (GPCR)
Mol. Mass.:40382.98
Organism:Homo sapiens (Human)
Description:Competition binding assays were carried out using membrane preparations from transfected HN9.10 cells that constitutively expressed the delta opioid receptor.
Residue:372
BDBM50105086
NameBDBM50105086
Synonyms:1-[1-(6-Nitro-benzo[1,3]dioxol-5-ylmethyl)-1,2,3,6-tetrahydro-pyridin-4-yl]-1,3-dihydro-benzoimidazol-2-one | CHEMBL115229
TypeSmall organic molecule
Emp. Form.C20H18N4O5
Mol. Mass.394.3807
SMILES[O-][N+](=O)c1cc2OCOc2cc1CN1CCC(=CC1)n1[c-]2ccccc2nc1=[OH+]